{"text_format":"1","workbook":"xlsx","n_sheets":7,"sheets":["Summary","Financial_Inputs","Performance Failure Scenarios","Performance Scenario","Gross Service Units","Availability Scenarios","Threshold Model"],"not_rendered":{"charts":2,"images":0,"macros":1,"external_links":0,"defined_names":14,"comments":2,"pivot_tables":0},"unopened":[{"sheet":"Performance Scenario","index":3,"reason":"not_a_worksheet"}],"bounds":{"document_bytes":16777216,"sheet_cells":100000,"rows_first":2000,"rows_last":500,"rows_between":2000,"halvings":0,"cell_chars":16384,"cell_head_chars":4096},"cells_cut":0,"cells_raw":0,"read":"whole","date_system":"1900"}

{"sheet":"Summary","index":0,"n_rows":81,"n_cols":11,"rows_kept":81,"cut":false,"hidden":false,"merged":[[80,0,88,10],[1,0,1,10],[8,0,8,4],[48,1,48,3],[50,1,50,3],[79,0,79,10],[22,0,22,4]]}
["Hub/NPD Payment Mechanism"]
["[Project Name]"]
["Payment Mechanism Calibration"]
[{"$f":"RIGHT(CELL(\"filename\",A1),LEN(CELL(\"filename\",A1))-FIND(\"]\",CELL(\"filename\",A1)))","v":"Summary"}]
["Calibration Model"]
[null,null,null,null,"Financial Scenario",null,"Scenario 1"]
[null,null,null,null,"Scenario Name",null,{"$f":"HLOOKUP($G$6,Financial_Inputs!$G$9:$P$38,3,FALSE)","v":0}]
[]
["FINANCIAL MODEL ASSUMPTIONS"]
[]
[null,"Annual Service Payment (ASPo)",null,null,null,null,{"$f":"HLOOKUP($G$6,Financial_Inputs!$G$9:$P$38,4,FALSE)","v":0}]
[null,"Indexable Factor (IF)",null,null,null,null,{"$f":"HLOOKUP($G$6,Financial_Inputs!$G$9:$P$38,5,FALSE)","v":0}]
[null,"Indexable Portion",null,null,null,null,{"$f":"G11*G12","v":0}]
[null,"Number of Days in the Contract Year",null,null,null,null,{"$f":"HLOOKUP($G$6,Financial_Inputs!$G$9:$P$38,7,FALSE)","v":0}]
[null,"Number of Days in the Contract Month",null,null,null,null,{"$f":"G14/12","v":0}]
{"$rows_left_out":67}
{"sheet":"Financial_Inputs","index":1,"n_rows":42,"n_cols":16,"rows_kept":42,"cut":false,"hidden":false,"merged":[[1,0,1,16],[24,0,24,4],[8,0,8,4]]}
["Hub/NPD Payment Mechanism"]
[{"$f":"Summary!A2","v":"[Project Name]"}]
["Payment Mechanism Calibration"]
[{"$f":"RIGHT(CELL(\"filename\",A1),LEN(CELL(\"filename\",A1))-FIND(\"]\",CELL(\"filename\",A1)))","v":"Financial_Inputs"}]
["Calibration Model"]
[]
["General Input"]
[]
["FINANCIAL MODEL ASSUMPTIONS",null,null,null,null,null,"Scenario 1","Scenario 2","Scenario 3","Scenario 4","Scenario 5","Scenario 6","Scenario 7","Scenario 8","Scenario 9","Scenario 10"]
[]
[null,"Scenario Name"]
[null,"Annual Service Payment (ASPo)"]
[null,"Indexable Factor (IF)"]
[null,"Indexed Portion",null,null,null,null,{"$f":"G12*G13","v":0},{"$f":"H12*H13","v":0},{"$f":"I12*I13","v":0},{"$f":"J12*J13","v":0},{"$f":"K12*K13","v":0},0,0,0,0,0]
[null,"Number of Days in the Contract Year"]
{"$rows_left_out":28}
{"sheet":"Performance Failure Scenarios","index":2,"n_rows":117,"n_cols":65,"rows_kept":117,"cut":false,"hidden":false,"merged":[[0,49,0,52],[114,0,114,7],[109,1,111,1],[109,3,111,3],[109,4,111,4],[109,5,111,5],[109,6,111,6],[109,0,111,0],[17,14,17,17],[17,0,18,0],[17,1,18,1],[15,9,16,17],[109,7,111,7],[49,0,49,7],[65,0,65,7],[50,0,50,7],[108,0,108,7],[78,0,78,7],[82,0,82,7],[86,0,86,7],[90,0,90,7],[95,0,95,7],[103,0,103,7],[106,0,106,7],[10,26,12,26],[6,23,7,26],[56,0,56,7],[58,0,58,7],[99,0,99,7],[66,0,66,7],[15,19,16,23],[17,25,17,26],[17,27,17,30],[15,25,16,30],[17,19,17,23],[46,0,46,7],[37,0,37,7],[19,0,19,7],[20,0,20,7],[23,0,23,7],[25,0,25,7],[34,0,34,7],[15,61,16,64],[59,0,59,7],[62,0,62,7],[17,56,17,59],[17,36,17,39],[17,40,17,43],[17,44,17,47],[15,32,16,35],[15,36,16,39],[17,32,17,35],[17,48,17,51],[17,52,17,55],[17,2,17,7],[17,9,17,12],[38,0,38,7],[41,0,41,7],[1,59,1,60],[2,59,2,60],[3,59,3,60],[11,36,11,39],[15,40,16,47],[15,48,16,59]]}
[{"$f":"Summary!A1","v":"Hub/NPD Payment Mechanism"},null,null,null,null,null,null,null,null,"Failures Per annum",null,null,null,null,null,null,null,null,null,"Deductions Per annum",null,null,null,null,null,null,null,null,null,null,null,null,null,null,null,null,null,null,null,null,null,null,null,null,null,null,null,null,null,"Deductions Per annum corrected for Reliefs and Ratchets",null,null,null,null,null,null,null,null,null,null,null,"Sessional Deduction","Day Deduction","Actual Deductions per DP","Number of PS"]
[{"$f":"Summary!A2","v":"[Project Name]"},null,null,null,null,null,null,null,null,"Good","Fair","Poor","Bad",null,null,null,null,null,null,"Good","Fair","Poor","Bad",null,null,null,null,null,null,null,null,null,null,null,null,null,null,null,null,null,null,null,null,null,null,null,null,null,null,"Good","Fair","Poor","Bad",null,null,null,null,null,null,"Minor",null,{"$f":"Summary!G26","v":0},{"$f":"BJ2*Summary!$G$16","v":0},{"$f":"IF(Summary!$G$40=\"Sessions\",'Performance Failure Scenarios'!BJ2,'Performance Failure Scenarios'!BK2)","v":0},{"$f":"COUNTIF(C:C,BH2)","v":13}]
[{"$f":"Summary!$A$3","v":"Payment Mechanism Calibration"},null,null,null,null,null,null,null,"Major",{"$f":"SUMIF($C$22:$C$117,$S$3,J$22:J$117)","v":0},{"$f":"SUMIF($C$22:$C$117,$S$3,K$22:K$117)","v":0},{"$f":"SUMIF($C$22:$C$117,$S$3,L$22:L$117)","v":0},{"$f":"SUMIF($C$22:$C$117,$S$3,M$22:M$117)","v":0},null,null,null,null,null,"Major",{"$f":"SUMIF($C$22:$C$117,$S$3,T$22:T$117)","v":0},{"$f":"SUMIF($C$22:$C$117,$S$3,U$22:U$117)","v":0},{"$f":"SUMIF($C$22:$C$117,$S$3,V$22:V$117)","v":0},{"$f":"SUMIF($C$22:$C$117,$S$3,W$22:W$117)","v":0},null,null,null,null,null,null,null,null,null,null,null,null,null,null,null,null,null,null,null,null,null,null,null,null,null,"Major",{"$f":"SUM(BE20:BE117)","v":0},{"$f":"SUM(BF20:BF117)","v":0},{"$f":"SUM(BG20:BG117)","v":0},{"$f":"SUM(BH20:BH117)","v":0},null,null,null,null,null,null,"Medium",null,{"$f":"Summary!G27","v":0},{"$f":"BJ3*Summary!$G$16","v":0},{"$f":"IF(Summary!$G$40=\"Sessions\",'Performance Failure Scenarios'!BJ3,'Performance Failure Scenarios'!BK3)","v":0},{"$f":"COUNTIF(C:C,BH3)","v":36}]
[{"$f":"RIGHT(CELL(\"filename\",A1),LEN(CELL(\"filename\",A1))-FIND(\"]\",CELL(\"filename\",A1)))","v":"Performance Failure Scenarios"},null,null,null,null,null,null,null,"Medium",{"$f":"SUMIF($C$22:$C$117,$S$4,J$22:J$117)","v":0},{"$f":"SUMIF($C$22:$C$117,$S$4,K$22:K$117)","v":0},{"$f":"SUMIF($C$22:$C$117,$S$4,L$22:L$117)","v":0},{"$f":"SUMIF($C$22:$C$117,$S$4,M$22:M$117)","v":0},null,null,null,null,null,"Medium",{"$f":"SUMIF($C$22:$C$117,$S$4,T$22:T$117)","v":0},{"$f":"SUMIF($C$22:$C$117,$S$4,U$22:U$117)","v":0},{"$f":"SUMIF($C$22:$C$117,$S$4,V$22:V$117)","v":0},{"$f":"SUMIF($C$22:$C$117,$S$4,W$22:W$117)","v":0},null,null,null,null,null,null,null,null,null,null,null,null,null,null,null,null,null,null,null,null,null,null,null,null,null,"Medium",{"$f":"SUM(BA20:BA117)","v":0},{"$f":"SUM(BB20:BB117)","v":0},{"$f":"SUM(BC20:BC117)","v":0},{"$f":"SUM(BD20:BD117)","v":0},null,null,null,null,null,null,"Major",null,{"$f":"Summary!G28","v":0},{"$f":"BJ4*Summary!$G$16","v":0},{"$f":"IF(Summary!$G$40=\"Sessions\",'Performance Failure Scenarios'!BJ4,'Performance Failure Scenarios'!BK4)","v":0},{"$f":"COUNTIF(C:C,BH4)","v":22}]
[null,null,null,null,null,null,null,null,"Minor",{"$f":"SUMIF($C$22:$C$117,$S$5,J$22:J$117)","v":0},{"$f":"SUMIF($C$22:$C$117,$S$5,K$22:K$117)","v":0},{"$f":"SUMIF($C$22:$C$117,$S$5,L$22:L$117)","v":0},{"$f":"SUMIF($C$22:$C$117,$S$5,M$22:M$117)","v":0},null,null,null,null,null,"Minor",{"$f":"SUMIF($C$22:$C$117,$S$5,T$22:T$117)","v":0},{"$f":"SUMIF($C$22:$C$117,$S$5,U$22:U$117)","v":0},{"$f":"SUMIF($C$22:$C$117,$S$5,V$22:V$117)","v":0},{"$f":"SUMIF($C$22:$C$117,$S$5,W$22:W$117)","v":0},null,null,null,null,null,null,null,null,null,null,null,null,null,null,null,null,null,null,null,null,null,null,null,null,null,"Minor",{"$f":"SUM(AW20:AW117)","v":0},{"$f":"SUM(AX20:AX117)","v":0},{"$f":"SUM(AY20:AY117)","v":0},{"$f":"SUM(AZ20:AZ117)","v":0}]
[null,null,null,null,null,null,null,null,"Total",{"$f":"SUM(J3:J5)","v":0},{"$f":"SUM(K3:K5)","v":0},{"$f":"SUM(L3:L5)","v":0},{"$f":"SUM(M3:M5)","v":0},null,null,null,null,null,"Total",{"$f":"SUM(T3:T5)","v":0},{"$f":"SUM(U3:U5)","v":0},{"$f":"SUM(V3:V5)","v":0},{"$f":"SUM(W3:W5)","v":0},null,null,null,null,null,null,null,null,null,null,null,null,null,null,null,null,null,null,null,null,null,null,null,null,null,"Total",{"$f":"SUM(AX3:AX5)","v":0},{"$f":"SUM(AY3:AY5)","v":0},0,0,null,null,null,null,null,null,null,null,{"$f":"BJ19","v":"Good"},{"$f":"BK19","v":"Fair"},{"$f":"BL19","v":"Poor"},"Bad"]
[null,null,null,null,null,null,null,null,null,null,null,null,null,null,null,null,null,null,null,null,null,null,null,"Relief and Ratchet Thresholds",null,null,null,null,null,null,null,null,null,null,null,null,null,null,null,null,null,null,null,null,null,null,null,null,null,null,null,null,null,null,null,null,null,null,null,null,"Total Deduction per Annum",{"$f":"SUM(BJ22:BJ117)","v":0},{"$f":"SUM(BK22:BK117)","v":0},{"$f":"SUM(BL22:BL1117)","v":0},{"$f":"SUM(BM22:BM1117)","v":0}]
[null,null,null,null,null,null,null,null,null,"Failures per month",null,null,null,null,null,null,null,null,null,"Deductions per month",null,null,null,null,null,null,null,null,null,null,null,null,null,null,null,null,null,null,null,null,null,null,null,null,null,null,null,null,null,null,null,null,null,null,null,null,null,null,null,null,"total Deduction as % of Indexable Portion",{"$f":"BJ7/Summary!$G$13","v":{"$error":"#DIV/0!"}},{"$f":"BK7/Summary!$G$13","v":{"$error":"#DIV/0!"}},{"$f":"BL7/Summary!$G$13","v":{"$error":"#DIV/0!"}},{"$f":"BM7/Summary!$G$13","v":{"$error":"#DIV/0!"}}]
[null,null,null,null,null,null,null,null,null,"Good","Fair","Poor","Bad",null,null,null,null,null,null,"Good","Fair","Poor","Bad",null,"Calculated Thresholds","Manual Thresholds"]
[null,null,null,null,null,null,null,null,"Major",{"$f":"J3/12","v":0},{"$f":"K3/12","v":0},{"$f":"L3/12","v":0},{"$f":"M3/12","v":0},null,null,null,null,null,"Major",{"$f":"T3/12","v":0},{"$f":"U3/12","v":0},{"$f":"V3/12","v":0},{"$f":"W3/12","v":0},"Good Minor",{"$f":"IF(Z10>0,Z10,ROUNDDOWN(MAX(AA22:AA117),0))","v":0},null,"Clause 2.3"]
[null,null,null,null,null,null,null,null,"Medium",{"$f":"J4/12","v":0},0,0,{"$f":"M4/12","v":0},null,null,null,null,null,"Medium",{"$f":"T4/12","v":0},0,0,{"$f":"W4/12","v":0},"Routine",{"$f":"IF(Z11>0,Z11,ROUNDDOWN(MAX(AC22:AC117),0))","v":0},null,"Clause 5"]
[null,null,null,null,null,null,null,null,"Minor",{"$f":"J5/12","v":0},0,0,{"$f":"M5/12","v":0},null,null,null,null,null,"Minor",0,0,0,{"$f":"W5/12","v":0},"Important",{"$f":"IF(Z12>0,Z12,ROUNDDOWN(MAX(AD22:AD117),0))","v":0},null,null,null,null,null,null,null,null,null,null,null,"Minor Deduction Eligibility Test"]
[null,null,null,null,null,null,null,null,"Total",{"$f":"SUM(J10:J12)","v":0},{"$f":"SUM(K10:K12)","v":0},{"$f":"SUM(L10:L12)","v":0},{"$f":"SUM(M10:M12)","v":0},null,null,null,null,null,"Total",{"$f":"SUM(T10:T12)","v":0},{"$f":"SUM(U10:U12)","v":0},{"$f":"SUM(V10:V12)","v":0},{"$f":"SUM(W10:W12)","v":0},"All Other",{"$f":"IF(Z13>0,Z13,ROUNDDOWN(MAX(AE22:AE117),0))","v":0},null,null,null,null,null,null,null,null,null,null,null,{"$f":"IF(T12>$Y$10,\"True\",\"False\")","v":"False"},{"$f":"IF(U12>$Y$10,\"True\",\"False\")","v":"False"},{"$f":"IF(V12>$Y$10,\"True\",\"False\")","v":"False"},{"$f":"IF(W12>$Y$10,\"True\",\"False\")","v":"False"}]
[]
[]
{"$rows_left_out":103}
{"sheet":"Gross Service Units","index":4,"n_rows":190,"n_cols":88,"rows_kept":190,"cut":false,"hidden":false,"merged":[[28,1,28,5],[32,16,32,17],[31,16,31,17],[32,30,33,31],[3,21,4,21],[29,19,29,20],[30,19,30,20],[31,19,31,20],[3,17,4,17],[3,16,4,16],[3,19,4,19],[28,18,28,20],[27,18,27,20],[28,29,28,31],[29,30,29,31],[30,30,30,31],[31,30,31,31],[31,27,31,28],[3,34,4,34],[3,35,4,35],[3,20,4,20],[3,32,4,32],[3,22,4,22],[3,23,4,23],[3,24,4,24],[3,31,4,31],[3,30,4,30],[3,28,4,28],[3,27,4,27],[3,33,4,33],[32,32,33,32],[32,21,33,21],[32,19,33,20],[35,38,35,87],[189,0,189,13],[34,6,34,8]]}
[]
[{"$f":"Summary!A1","v":"Hub/NPD Payment Mechanism"}]
[{"$f":"Summary!A2","v":"[Project Name]"},null,null,null,null,null,null,null,null,null,null,null,null,null,null,null,null,null,null,"Utilising SUF*TSD",null,null,null,null,null,null,null,"Utilising TAGSUF"]
[{"$f":"Summary!$A$3","v":"Payment Mechanism Calibration"},null,null,null,null,null,null,null,null,null,null,null,null,null,null,null,"Cumulative % of Rooms","Cumulative No. of Rooms",null,"Deduction Per Session (Calculated)","Number of Rooms","Deduction Cost per Room","Deduction Per Session (Actual)","Number of Rooms","Deduction Cost per Room",null,null,"Cumulative % of Rooms","Cumulative No. of Rooms",null,"Deduction Per Session (Calculated)","Number of Rooms","Deduction Cost per Room","Deduction Per Session (Actual)","Number of Rooms","Deduction Cost per Room"]
[{"$f":"RIGHT(CELL(\"filename\",A2),LEN(CELL(\"filename\",A2))-FIND(\"]\",CELL(\"filename\",A2)))","v":"Gross Service Units"}]
[null,null,null,null,null,null,null,null,null,null,null,null,null,null,null,1,{"$f":"R6/$J$36","v":{"$error":"#DIV/0!"}},{"$f":"R7+U6","v":0},null,{"$f":"IF(ISERROR(LARGE(U$39:U$190,$P6)),0,LARGE(U$39:U$190,$P6))","v":0},{"$f":"IF(T6=0,0,SUMIF(T$39:T$190,T6,$E$39:$E$190))","v":0},{"$f":"T6*U6","v":0},{"$f":"IF(ISERROR(LARGE(W$39:W$190,$P6)),0,LARGE(W$39:W$190,$P6))","v":0},{"$f":"IF(W6=0,0,SUMIF(V$39:V$190,W6,$E$39:$E$190))","v":0},{"$f":"W6*X6","v":0},null,null,{"$f":"AC6/$J$36","v":{"$error":"#DIV/0!"}},{"$f":"AC7+AF6","v":0},null,{"$f":"IF(ISERROR(LARGE(AF$39:AF$190,$P6)),0,LARGE(AF$39:AF$190,$P6))","v":0},{"$f":"IF(AE6=0,0,SUMIF(AE$39:AE$190,AE6,$E$39:$E$190))","v":0},{"$f":"AE6*AF6","v":0},{"$f":"IF(ISERROR(LARGE(AH$39:AH$190,$P6)),0,LARGE(AH$39:AH$190,$P6))","v":0},{"$f":"IF(AH6=0,0,SUMIF(AG$39:AG$190,AH6,$E$39:$E$190))","v":0},{"$f":"AH6*AI6","v":0}]
[null,null,null,null,"Default Sessions",{"$f":"Summary!G16","v":0},null,null,null,null,null,null,null,null,null,2,{"$f":"R7/$J$36","v":{"$error":"#DIV/0!"}},0,null,0,0,0,0,0,0,null,null,{"$f":"AC7/$J$36","v":{"$error":"#DIV/0!"}},0,null,0,0,0,0,0,{"$f":"AH7*AI7","v":0}]
[null,"Department Table",null,null,null,null,null,null,"Weighting Adjustment Table",null,null,null,null,null,null,3,{"$error":"#DIV/0!"},0,null,0,0,0,0,0,0,null,null,{"$error":"#DIV/0!"},0,null,0,0,0,0,0,0]
[null,"Department","Comments","Department Priority","Days","Sessions",null,null,"Unweighted Score","Weighted",null,null,null,null,null,4,{"$error":"#DIV/0!"},0,null,0,0,0,0,0,0,null,null,{"$error":"#DIV/0!"},0,null,0,0,0,0,0,0]
[null,null,null,null,null,null,null,null,1,null,null,null,null,null,null,5,{"$error":"#DIV/0!"},0,null,0,0,0,0,0,0,null,null,{"$error":"#DIV/0!"},0,null,0,0,0,0,0,0]
[null,null,null,null,null,null,null,null,2,null,null,null,null,null,null,6,{"$error":"#DIV/0!"},0,null,0,0,0,0,0,0,null,null,{"$error":"#DIV/0!"},0,null,0,0,0,0,0,0]
[null,null,null,null,null,null,null,null,3,null,null,null,null,null,null,7,{"$error":"#DIV/0!"},0,null,0,0,0,0,0,0,null,null,{"$error":"#DIV/0!"},0,null,0,0,0,0,0,0]
[null,null,null,null,null,null,null,null,4,null,null,null,null,null,null,8,{"$error":"#DIV/0!"},0,null,0,0,0,0,0,0,null,null,{"$error":"#DIV/0!"},0,null,0,0,0,0,0,0]
[null,null,null,null,null,null,null,null,5,null,null,null,null,null,null,9,{"$error":"#DIV/0!"},0,null,0,0,0,0,0,0,null,null,{"$error":"#DIV/0!"},0,null,0,0,0,0,0,0]
[null,null,null,null,null,null,null,null,6,null,null,null,null,null,null,10,{"$error":"#DIV/0!"},0,null,0,0,0,0,0,0,null,null,{"$error":"#DIV/0!"},0,null,0,0,0,0,0,0]
{"$rows_left_out":176}
{"sheet":"Availability Scenarios","index":5,"n_rows":188,"n_cols":37,"rows_kept":188,"cut":false,"hidden":false,"merged":[[9,1,9,3],[10,1,10,3],[12,1,12,3],[15,21,15,22],[10,21,10,22],[11,21,11,22],[12,21,12,22],[13,21,13,22],[14,21,14,22],[13,1,13,3],[11,1,11,3],[14,1,14,3],[15,1,15,3],[187,0,187,36],[28,22,28,24],[31,22,31,24],[32,22,32,24],[33,22,33,24],[34,22,34,24],[6,25,6,27],[6,28,6,30],[6,31,6,34],[6,35,6,36],[8,25,9,25],[8,26,9,26],[8,27,9,27],[8,28,9,28],[8,29,9,29],[8,30,9,30],[6,8,6,10],[6,11,6,13],[6,14,6,17],[6,18,6,19],[8,19,9,19],[8,18,9,18],[8,17,9,17],[8,16,9,16],[8,15,9,15],[8,14,9,14],[8,13,9,13],[8,12,9,12],[8,11,9,11],[8,10,9,10],[8,9,9,9],[8,8,9,8],[16,1,16,3],[18,1,18,3],[17,1,17,3],[24,21,24,22],[25,21,25,22],[16,21,16,22],[17,21,17,22],[18,21,18,22],[26,21,26,22],[19,1,19,3],[20,1,20,3],[21,21,21,22],[22,21,22,22],[23,21,23,22],[19,21,19,22],[20,21,20,22]]}
[{"$f":"Summary!A1","v":"Hub/NPD Payment Mechanism"}]
[{"$f":"Summary!A2","v":"[Project Name]"}]
[{"$f":"Summary!A3","v":"Payment Mechanism Calibration"}]
[{"$f":"RIGHT(CELL(\"filename\",A1),LEN(CELL(\"filename\",A1))-FIND(\"]\",CELL(\"filename\",A1)))","v":"Availability Scenarios"}]
[]
[null,"Selected SUR",null,null,{"$f":"IF(Summary!G39=Summary!C78,Summary!G65,Summary!G69)","v":{"$error":"#DIV/0!"}}]
[null,null,null,null,null,null,null,null,"Single Day Single Room",null,null,"Multiple Day Single Room",null,null,"Multiple Rooms, Single Day",null,null,null,"Zonal Loss",null,null,null,null,null,null,"Single Day Single Room",null,null,"Multiple Day Single Room",null,null,"Multiple Rooms, Single Day",null,null,null,"Zonal Loss"]
[null,null,null,null,null,null,null,null,"Scenario 1 - Description","Scenario 2 - Description","Scenario 3 - Description","Scenario 4 - Description","Scenario 5 - Description","Scenario 6 - Description","Scenario 7 - Description","Scenario 8 - Description","Scenario 9 - Description","Scenario 10 - Description","Scenario 11 - Description","Scenario 12 - Description",null,null,null,null,null,"Scenario 1 - Description","Scenario 2 - Description","Scenario 3 - Description","Scenario 4 - Description","Scenario 5 - Description","Scenario 6 - Description","Scenario 7 - Description","Scenario 8 - Description","Scenario 9 - Description","Scenario 10 - Description","Scenario 11 - Description","Scenario 12 - Description"]
[null,null,null,null,null,null,null,null,{"$f":"IF(Summary!$G$40=\"Sessions\",IF(I32=\"\",\"\",IF(I33>1,I32&\" or similar value room out for \"&I33&\" Sessions\",I32&\" or similar value room out for \"&I33&\" Session\")),IF(I32=\"\",\"\",IF(ROUNDUP(I33/Z30,0)>1,I32&\" or similar value room out for \"&(ROUNDUP(I33/Z30,0))&\" Days\",I32&\" or similar value room out for \"&ROUNDUP(I33/3,0)&\" Day\")))","v":""},{"$f":"IF(Summary!$G$40=\"Sessions\",IF(J32=\"\",\"\",IF(J33>1,J32&\" or similar value room out for \"&J33&\" Sessions\",J32&\" or similar value room out for \"&J33&\" Session\")),IF(J32=\"\",\"\",IF(ROUNDUP(J33/AA30,0)>1,J32&\" or similar value room out for \"&(ROUNDUP(J33/AA30,0))&\" Days\",J32&\" or similar value room out for \"&ROUNDUP(J33/3,0)&\" Day\")))","v":""},{"$f":"IF(Summary!$G$40=\"Sessions\",IF(K32=\"\",\"\",IF(K33>1,K32&\" or similar value room out for \"&K33&\" Sessions\",K32&\" or similar value room out for \"&K33&\" Session\")),IF(K32=\"\",\"\",IF(ROUNDUP(K33/AB30,0)>1,K32&\" or similar value room out for \"&(ROUNDUP(K33/AB30,0))&\" Days\",K32&\" or similar value room out for \"&ROUNDUP(K33/3,0)&\" Day\")))","v":""},{"$f":"IF(Summary!$G$40=\"Sessions\",IF(L32=\"\",\"\",IF(L33>1,L32&\" or similar value room out for \"&L33&\" Sessions\",L32&\" or similar value room out for \"&L33&\" Session\")),IF(L32=\"\",\"\",IF(ROUNDUP(L33/AC30,0)>1,L32&\" or similar value room out for \"&(ROUNDUP(L33/AC30,0))&\" Days\",L32&\" or similar value room out for \"&ROUNDUP(L33/3,0)&\" Day\")))","v":""},{"$f":"IF(Summary!$G$40=\"Sessions\",IF(M32=\"\",\"\",IF(M33>1,M32&\" or similar value room out for \"&M33&\" Sessions\",M32&\" or similar value room out for \"&M33&\" Session\")),IF(M32=\"\",\"\",IF(ROUNDUP(M33/AD30,0)>1,M32&\" or similar value room out for \"&(ROUNDUP(M33/AD30,0))&\" Days\",M32&\" or similar value room out for \"&ROUNDUP(M33/3,0)&\" Day\")))","v":""},{"$f":"IF(Summary!$G$40=\"Sessions\",IF(N32=\"\",\"\",IF(N33>1,N32&\" or similar value room out for \"&N33&\" Sessions\",N32&\" or similar value room out for \"&N33&\" Session\")),IF(N32=\"\",\"\",IF(ROUNDUP(N33/AE30,0)>1,N32&\" or similar value room out for \"&(ROUNDUP(N33/AE30,0))&\" Days\",N32&\" or similar value room out for \"&ROUNDUP(N33/3,0)&\" Day\")))","v":""},{"$f":"IF(Summary!$G$40=\"Sessions\",IF(O32=\"\",\"\",IF(O33>1,O32&\" or similar value room out for \"&O33&\" Sessions\",O32&\" or similar value room out for \"&O33&\" Session\")),IF(O32=\"\",\"\",IF(ROUNDUP(O33/AF30,0)>1,O32&\" or similar value room out for \"&(ROUNDUP(O33/AF30,0))&\" Days\",O32&\" or similar value room out for \"&ROUNDUP(O33/3,0)&\" Day\")))","v":""},{"$f":"IF(Summary!$G$40=\"Sessions\",IF(P32=\"\",\"\",IF(P33>1,P32&\" or similar value room out for \"&P33&\" Sessions\",P32&\" or similar value room out for \"&P33&\" Session\")),IF(P32=\"\",\"\",IF(ROUNDUP(P33/AG30,0)>1,P32&\" or similar value room out for \"&(ROUNDUP(P33/AG30,0))&\" Days\",P32&\" or similar value room out for \"&ROUNDUP(P33/3,0)&\" Day\")))","v":""},{"$f":"IF(Summary!$G$40=\"Sessions\",IF(Q32=\"\",\"\",IF(Q33>1,Q32&\" or similar value room out for \"&Q33&\" Sessions\",Q32&\" or similar value room out for \"&Q33&\" Session\")),IF(Q32=\"\",\"\",IF(ROUNDUP(Q33/AH30,0)>1,Q32&\" or similar value room out for \"&(ROUNDUP(Q33/AH30,0))&\" Days\",Q32&\" or similar value room out for \"&ROUNDUP(Q33/3,0)&\" Day\")))","v":""},{"$f":"IF(Summary!$G$40=\"Sessions\",IF(R32=\"\",\"\",IF(R33>1,R32&\" or similar value room out for \"&R33&\" Sessions\",R32&\" or similar value room out for \"&R33&\" Session\")),IF(R32=\"\",\"\",IF(ROUNDUP(R33/AI30,0)>1,R32&\" or similar value room out for \"&(ROUNDUP(R33/AI30,0))&\" Days\",R32&\" or similar value room out for \"&ROUNDUP(R33/3,0)&\" Day\")))","v":""},{"$f":"IF(Summary!$G$40=\"Sessions\",IF(S32=\"\",\"\",IF(S33>1,S32&\" or similar value room out for \"&S33&\" Sessions\",S32&\" or similar value room out for \"&S33&\" Session\")),IF(S32=\"\",\"\",IF(ROUNDUP(S33/AJ30,0)>1,S32&\" or similar value room out for \"&(ROUNDUP(S33/AJ30,0))&\" Days\",S32&\" or similar value room out for \"&ROUNDUP(S33/3,0)&\" Day\")))","v":""},{"$f":"IF(Summary!$G$40=\"Sessions\",IF(T32=\"\",\"\",IF(T33>1,T32&\" or similar value room out for \"&T33&\" Sessions\",T32&\" or similar value room out for \"&T33&\" Session\")),IF(T32=\"\",\"\",IF(ROUNDUP(T33/AK30,0)>1,T32&\" or similar value room out for \"&(ROUNDUP(T33/AK30,0))&\" Days\",T32&\" or similar value room out for \"&ROUNDUP(T33/3,0)&\" Day\")))","v":""}]
[null,"Unavailable Scenarios",null,null,"Events Per Month","Events Per Year"]
[null,"Good",null,null,{"$f":"F11/12","v":0},{"$f":"SUM(G11:U11)","v":0},null,null,null,null,null,null,null,null,null,null,null,null,null,null,null,"Rooms out per scenario",null,null,null,{"$f":"SUM(I37:I188)","v":0},0,0,0,0,0,0,0,0,0,0,0]
[null,"Fair",null,null,{"$f":"F12/12","v":0},{"$f":"SUM(G12:U12)","v":0},null,null,null,null,null,null,null,null,null,null,null,null,null,null,null,"Fair Unavailable Rooms Out",null,{"$f":"Y12/12","v":0},{"$f":"SUM(Z12:AK12)","v":0},{"$f":"Z11*I13","v":0},0,0,0,0,0,0,0,0,0,0,0]
[null,"Poor",null,null,{"$f":"F13/12","v":0},{"$f":"SUM(G13:U13)","v":0},null,null,null,null,null,null,null,null,null,null,null,null,null,null,null,"Fair UBU Rooms Out",null,{"$f":"Y13/12","v":0},{"$f":"SUM(Z13:AK13)","v":0},{"$f":"Z11*I19","v":0},0,0,0,0,0,0,0,0,0,0,0]
[null,"Bad",null,null,{"$f":"F14/12","v":0},{"$f":"SUM(G14:U14)","v":0},null,null,null,null,null,null,null,null,null,null,null,null,null,null,null,"Poor Unavailable Rooms Out",null,{"$f":"Y14/12","v":0},{"$f":"SUM(Z14:AK14)","v":0},{"$f":"Z11*I14","v":0},0,0,0,0,0,0,0,0,0,0,0]
[null,null,null,null,{"$f":"E11+E17","v":0},null,null,null,null,null,null,null,null,null,null,null,null,null,null,null,null,"Poor UBU Rooms Out",null,{"$f":"Y15/12","v":0},{"$f":"SUM(Z15:AK15)","v":0},{"$f":"Z11*I20","v":0},0,0,0,0,0,0,0,0,0,0,0]
{"$rows_left_out":174}
{"sheet":"Threshold Model","index":6,"n_rows":120,"n_cols":27,"rows_kept":120,"cut":false,"hidden":false,"merged":[[89,2,89,3],[90,2,90,3],[35,0,36,0],[37,0,38,0],[35,2,35,3],[36,2,36,3],[37,2,37,3],[38,2,38,3]]}
[{"$f":"Summary!A1","v":"Hub/NPD Payment Mechanism"}]
[{"$f":"Summary!A2","v":"[Project Name]"}]
[{"$f":"Summary!$A$3","v":"Payment Mechanism Calibration"}]
[{"$f":"RIGHT(CELL(\"filename\",A1),LEN(CELL(\"filename\",A1))-FIND(\"]\",CELL(\"filename\",A1)))","v":"Threshold Model"}]
[]
["Year 1 ASP",{"$f":"Summary!G11","v":0}]
["IF",{"$f":"Summary!G12","v":0}]
["RPI",{"$f":"Summary!G72","v":0}]
[]
["Basic Indexations","Year 1","Year 2","Year 3","Year 4","Year 5","Year 6","Year 7","Year 8","Year 9","Year 10","Year 11","Year 12","Year 13","Year 14","Year 15","Year 16","Year 17","Year 18","Year 19","Year 20","Year 21","Year 22","Year 23","Year 24","Year 25"]
["Minor Performance Deduction",{"$f":"Summary!G26","v":0},{"$f":"B11*(1+$B$8)","v":0},0,0,0,0,0,0,0,0,0,0,0,0,0,0,0,0,0,0,0,0,0,0,0]
["Medium Performance Deduction",{"$f":"Summary!G27","v":0},{"$f":"B12*(1+$B$8)","v":0},0,0,0,0,0,0,0,0,0,0,0,0,0,0,0,0,0,0,0,0,0,0,0]
["Major Performance Deduction",{"$f":"Summary!G28","v":0},{"$f":"B13*(1+$B$8)","v":0},0,0,0,0,0,0,0,0,0,0,0,0,0,0,0,0,0,0,0,0,0,0,0]
["Whole Facility Unavailability (per day)",{"$f":"IF(Summary!G39=\"TAGSUF\",IF(Summary!G40=\"Sessions\",Summary!G46*Summary!G16,Summary!G46),Summary!G46)","v":0},{"$f":"C15+C16","v":0},0,0,0,0,0,0,0,0,0,0,0,0,0,0,0,0,0,0,0,0,0,0,0]
["Non indexable Portion",{"$f":"B14*(1-B7)","v":0},{"$f":"B15","v":0},0,0,0,0,0,0,0,0,0,0,0,0,0,0,0,0,0,0,0,0,0,0,0]
{"$rows_left_out":105}